BDBM498600 (1R,3S)-3-(3-{[(4- methylpyridin-2- yl)acetyl]amino}-1H-pyrazol-5- yl)cyclopentyl (1- methylcyclopropyl)carbamate::US11014911, Example 425::US11718603, Example 425
SMILES Cc1ccnc(CC(=O)Nc2cc([nH]n2)[C@H]2CC[C@H](C2)OC(=O)NC2(C)CC2)c1
InChI Key
Data  2 KI
  Tab Delimited (TSV)   2D SDfile   Computed 3D by Vconf -m prep SDfile
Find this compound or compounds like it in BindingDB:
Activity Spreadsheet -- Enzyme Inhibition Constant Data from BindingDB
Found 2 hits for monomerid = 498600
TargetCyclin-dependent kinase 2/G1/S-specific cyclin-E1(Homo sapiens (Human))
Pfizer
US Patent
LigandPNGBDBM498600((1R,3S)-3-(3-{[(4- methylpyridin-2- yl)acetyl]am...)
Affinity DataKi:  1.05nM. Assay description: The purpose of CDK2/Cyclin E1 assay is to evaluate the inhibition (% inhibition, Kiapp and Ki values) of small molecule inhibitors by using a fluores...
Ligand InfoPC cidPC sid
In DepthDetails US Patent
TargetCyclin-dependent kinase 2/G1/S-specific cyclin-E1(Homo sapiens (Human))
Pfizer
US Patent
LigandPNGBDBM498600((1R,3S)-3-(3-{[(4- methylpyridin-2- yl)acetyl]am...)
Affinity DataKi:  1.05nM. Assay description: The purpose of CDK2/Cyclin E1 assay is to evaluate the inhibition (% inhibition, Kiapp and Ki values) of small molecule inhibitors by using a fluores...
Ligand InfoPC cidPC sid
In DepthDetails US Patent