BDBM498673 (1S,3R)-3-(3-{[(3,5- difluorophenyl)acetyl]amino}- 1H-pyrazol-5-yl)cyclopentyl [(2R)-tetrahydrofuran-2- ylmethyl]carbamate::US11014911, Example 498::US11718603, Example 498
SMILES Fc1cc(F)cc(CC(=O)Nc2cc([nH]n2)[C@@H]2CC[C@@H](C2)OC(=O)NC[C@H]2CCCO2)c1
InChI Key
Data  2 KI
  Tab Delimited (TSV)   2D SDfile   Computed 3D by Vconf -m prep SDfile
Find this compound or compounds like it in BindingDB:
Activity Spreadsheet -- Enzyme Inhibition Constant Data from BindingDB
Found 2 hits for monomerid = 498673
TargetCyclin-dependent kinase 2/G1/S-specific cyclin-E1(Homo sapiens (Human))
Pfizer
US Patent
LigandPNGBDBM498673((1S,3R)-3-(3-{[(3,5- difluorophenyl)acetyl]amino}...)
Affinity DataKi:  4.28nM. Assay description: The purpose of CDK2/Cyclin E1 assay is to evaluate the inhibition (% inhibition, Kiapp and Ki values) of small molecule inhibitors by using a fluores...
Ligand InfoPC cidPC sid
In DepthDetails US Patent
TargetCyclin-dependent kinase 2/G1/S-specific cyclin-E1(Homo sapiens (Human))
Pfizer
US Patent
LigandPNGBDBM498673((1S,3R)-3-(3-{[(3,5- difluorophenyl)acetyl]amino}...)
Affinity DataKi:  4.28nM. Assay description: The purpose of CDK2/Cyclin E1 assay is to evaluate the inhibition (% inhibition, Kiapp and Ki values) of small molecule inhibitors by using a fluores...
Ligand InfoPC cidPC sid
In DepthDetails US Patent