BDBM49987 MLS000775145::SMR000364885::cid_16196816::sulfuric acid;4-[(N''E)-N''-[4-(trifluoromethyl)benzylidene]hydrazino]benzoic acid::sulfuric acid;4-[(N'E)-N'-[4-(trifluoromethyl)benzylidene]hydrazino]benzoic acid::sulfuric acid;4-[2-[[4-(trifluoromethyl)phenyl]methylidene]hydrazinyl]benzoic acid::sulfuric acid;4-[N'-[4-(trifluoromethyl)benzylidene]hydrazino]benzoic acid
SMILES OC(=O)c1ccc(cc1)N=NCc1ccc(cc1)C(F)(F)F
InChI Key InChIKey=GAMLIDKZOQUSFZ-UHFFFAOYSA-N
Data  2 IC50  1 EC50
  Tab Delimited (TSV)   2D SDfile   Computed 3D by Vconf -m prep SDfile
Find this compound or compounds like it in BindingDB:
Activity Spreadsheet -- Enzyme Inhibition Constant Data from BindingDB
Found 3 hits for monomerid = 49987
TargetTranscription factor p65(Homo sapiens (Human))
Srmlsc
Curated by PubChem BioAssay
LigandPNGBDBM49987(MLS000775145 | SMR000364885 | cid_16196816 | sulfu...)
Affinity DataEC50:  201nM. Assay description: Southern Research Molecular Libraries Screening Center (SRMLSC) Southern Research Institute (Birmingham, Alabama) NIH Molecular Libraries Screening C...
In DepthDetails PCBioAssay
TargetEndothelial PAS domain-containing protein 1(Homo sapiens (Human))
Burnham Center For Chemical Genomics
Curated by PubChem BioAssay
LigandPNGBDBM49987(MLS000775145 | SMR000364885 | cid_16196816 | sulfu...)
Affinity DataIC50:  9.84E+3nM
In DepthDetails PCBioAssay
TargetM17 leucyl aminopeptidase(Plasmodium falciparum 3D7)
Srmlsc
Curated by PubChem BioAssay
LigandPNGBDBM49987(MLS000775145 | SMR000364885 | cid_16196816 | sulfu...)
Affinity DataIC50:  4.63E+4nM. Assay description: Southern Research Molecular Libraries Screening Center (SRMLSC) Southern Research Institute (Birmingham, Alabama) NIH Molecular Libraries Screening...
In DepthDetails PCBioAssay