BDBM500011 US11021454, Compound D-dopa
SMILES N[C@H](Cc1ccc(O)c(O)c1)C(O)=O
InChI Key InChIKey=WTDRDQBEARUVNC-ZCFIWIBFSA-N
Data  1 IC50
  Tab Delimited (TSV)   2D SDfile   Computed 3D by Vconf -m prep SDfile
Find this compound or compounds like it in BindingDB:
Activity Spreadsheet -- Enzyme Inhibition Constant Data from BindingDB
Found 1 hit for monomerid = 500011
TargetXanthine dehydrogenase/oxidase(Homo sapiens (Human))
China Pharmaceutical University
US Patent
LigandPNGBDBM500011(US11021454, Compound D-dopa)
Affinity DataIC50: >6.00E+4nM. Assay description: 11.1 Preparation of Reagents and Standard Solutions(1) 75 mM phosphate buffer (PB, pH 7.4): containing KH2PO4 0.0956 g, K2HPO4 0.6946 g, EDTA 1.862 m...
In DepthDetails US Patent