BDBM50003243 4-(3-Morpholin-4-ylmethyl-benzoyl)-thiophene-2-sulfonic acid amide; hydrochloride::CHEMBL555355
SMILES NS(=O)(=O)c1cc(cs1)C(=O)c1cccc(CN2CCOCC2)c1
InChI Key InChIKey=OZVILYXCMAQHFM-UHFFFAOYSA-N
Data  1 KI
  Tab Delimited (TSV)   2D SDfile   Computed 3D by Vconf -m prep SDfile
Find this compound or compounds like it in BindingDB:
Activity Spreadsheet -- Enzyme Inhibition Constant Data from BindingDB
Found 1 hit for monomerid = 50003243
TargetCarbonic anhydrase 2(Homo sapiens (Human))
Merck Research Laboratories
Curated by ChEMBL
LigandPNGBDBM50003243(4-(3-Morpholin-4-ylmethyl-benzoyl)-thiophene-2-sul...)
Affinity DataKi:  11nM. Assay description: Inhibition of human carbonic anhydrase II
In DepthDetails ArticlePubMed