BDBM50003432 1-Cyclopropyl-3-(hydroxy-naphthalen-2-ylmethyl-amino)-propenone::CHEMBL132228
SMILES ON(Cc1ccc2ccccc2c1)C=CC(=O)C1CC1
InChI Key InChIKey=UYIYPBNWVBTFKD-UHFFFAOYSA-N
Data  1 IC50
  Tab Delimited (TSV)   2D SDfile   Computed 3D by Vconf -m prep SDfile
Find this compound or compounds like it in BindingDB:
Activity Spreadsheet -- Enzyme Inhibition Constant Data from BindingDB
Found 1 hit for monomerid = 50003432
TargetPolyunsaturated fatty acid 5-lipoxygenase(Rattus norvegicus)
Dupont Pharmaceuticals
Curated by ChEMBL
LigandPNGBDBM50003432(1-Cyclopropyl-3-(hydroxy-naphthalen-2-ylmethyl-ami...)
Affinity DataIC50:  1.50E+3nM. Assay description: inhibitory activity against 5-lipoxygenase in rat basophilic leukemia cell line.
In DepthDetails ArticlePubMed