BDBM50003604 9-(1-Bromomethyl-heptyl)-9H-purin-6-ylamine::CHEMBL336735
SMILES CCCCCC[C@H](CBr)n1cnc2c(N)ncnc12
InChI Key InChIKey=GENISLGGIWRJOM-SNVBAGLBSA-N
Data  1 KI
  Tab Delimited (TSV)   2D SDfile   Computed 3D by Vconf -m prep SDfile
Find this compound or compounds like it in BindingDB:
Activity Spreadsheet -- Enzyme Inhibition Constant Data from BindingDB
Found 1 hit for monomerid = 50003604
TargetAdenosine deaminase(Bos taurus (bovine))
University Of Rhode Island
Curated by ChEMBL
LigandPNGBDBM50003604(9-(1-Bromomethyl-heptyl)-9H-purin-6-ylamine | CHEM...)
Affinity DataKi:  600nM. Assay description: Binding affinity (Ki) at calf intestinal adenosine deaminase.Checked by Author
In DepthDetails ArticlePubMed