BDBM50003986 CHEMBL3236107
SMILES COc1ccc(cn1)N1C[C@H](CN)[C@H](CC1=O)c1cc(F)ccc1F
InChI Key InChIKey=NKEXHLNBBIIVHY-FZMZJTMJSA-N
Data  1 IC50
  Tab Delimited (TSV)   2D SDfile   Computed 3D by Vconf -m prep SDfile
Find this compound or compounds like it in BindingDB:
Activity Spreadsheet -- Enzyme Inhibition Constant Data from BindingDB
Found 1 hit for monomerid = 50003986
TargetDipeptidyl peptidase 4(Homo sapiens (Human))
M.S. University Of Baroda
Curated by ChEMBL
LigandPNGBDBM50003986(CHEMBL3236107)
Affinity DataIC50:  452nM. Assay description: Inhibition of human DPP-4 expressed in baculovirus expression system using H-Gly-Pro-AMC as substrate after 30 mins by fluorometric analysis
In DepthDetails ArticlePubMed