BDBM50004105 CHEMBL3236128
SMILES Cc1cc2ncc(N3C[C@H](CN)[C@H](CC3=O)c3ccc(Cl)cc3Cl)c(C)n2n1
InChI Key InChIKey=BBXONIJPHKIUGA-BBRMVZONSA-N
Data  1 IC50
  Tab Delimited (TSV)   2D SDfile   Computed 3D by Vconf -m prep SDfile
Find this compound or compounds like it in BindingDB:
Activity Spreadsheet -- Enzyme Inhibition Constant Data from BindingDB
Found 1 hit for monomerid = 50004105
TargetDipeptidyl peptidase 4(Homo sapiens (Human))
M.S. University Of Baroda
Curated by ChEMBL
LigandPNGBDBM50004105(CHEMBL3236128)
Affinity DataIC50:  148nM. Assay description: Inhibition of human DPP-4 expressed in baculovirus expression system using H-Gly-Pro-AMC as substrate after 30 mins by fluorometric analysis
In DepthDetails ArticlePubMed