BDBM50005040 5,7-Dichloro-4-(2-cyclohexyl-acetylamino)-1,2,3,4-tetrahydro-quinoline-2-carboxylic acid::CHEMBL58405
SMILES OC(=O)[C@H]1C[C@H](NC(=O)CC2CCCCC2)c2c(Cl)cc(Cl)cc2N1
InChI Key InChIKey=AYWGNPUJWNXZNH-LSDHHAIUSA-N
Data  1 IC50
  Tab Delimited (TSV)   2D SDfile   Computed 3D by Vconf -m prep SDfile
Find this compound or compounds like it in BindingDB:
Activity Spreadsheet -- Enzyme Inhibition Constant Data from BindingDB
Found 1 hit for monomerid = 50005040
TargetGlutamate receptor ionotropic, NMDA 1(RAT)
Merck Sharp and Dohme Research Laboratories
Curated by ChEMBL
LigandPNGBDBM50005040(5,7-Dichloro-4-(2-cyclohexyl-acetylamino)-1,2,3,4-...)
Affinity DataIC50:  110nM. Assay description: Inhibition of [3H]- glycine binding to NMDA receptor from rat cortical membranes.
In DepthDetails ArticlePubMed