BDBM50005430 4-[2-Dimethylamino-2-(3-naphthalen-1-yl-2-naphthalen-1-ylmethyl-propionylamino)-acetylamino]-3-hydroxy-6-methyl-heptanoic acid (2-methyl-butyl)-amide::CHEMBL3350018
SMILES CC[C@H](C)CNC(=O)C[C@H](O)[C@H](CC(C)C)NC(=O)C(NC(=O)C(Cc1cccc2ccccc12)Cc1cccc2ccccc12)N(C)C
InChI Key InChIKey=YAUSVFMEGKSCJG-SQYNCZPISA-N
Data  2 IC50
  Tab Delimited (TSV)   2D SDfile   Computed 3D by Vconf -m prep SDfile
Find this compound or compounds like it in BindingDB:
Activity Spreadsheet -- Enzyme Inhibition Constant Data from BindingDB
Found 2 hits for monomerid = 50005430
TargetRenin(Homo sapiens (Human))
Warner-Lambert
Curated by ChEMBL
LigandPNGBDBM50005430(4-[2-Dimethylamino-2-(3-naphthalen-1-yl-2-naphthal...)
Affinity DataIC50: >1.00E+3nM. Assay description: Inhibitory activity against monkey renin in vitro.
In DepthDetails ArticlePubMed
TargetRenin(Homo sapiens (Human))
Warner-Lambert
Curated by ChEMBL
LigandPNGBDBM50005430(4-[2-Dimethylamino-2-(3-naphthalen-1-yl-2-naphthal...)
Affinity DataIC50:  74nM. Assay description: Inhibitory activity against monkey renin in vitro.
In DepthDetails ArticlePubMed