BDBM50006050 3-{3-[(4-Dodecyloxy-2-hexanoyl-phenoxy)-hydroxy-phosphoryloxy]-benzyl}-5-methyl-thiazol-3-ium::CHEMBL47158
SMILES CCCCCCCCCCCCOc1ccc(OP([O-])(=O)Oc2cccc(C[n+]3csc(C)c3)c2)c(c1)C(=O)CCCCC
InChI Key InChIKey=ZYKSWVVZCGMXJP-UHFFFAOYSA-N
Data  1 IC50
  Tab Delimited (TSV)   2D SDfile   Computed 3D by Vconf -m prep SDfile
Find this compound or compounds like it in BindingDB:
Activity Spreadsheet -- Enzyme Inhibition Constant Data from BindingDB
Found 1 hit for monomerid = 50006050
TargetPlatelet-activating factor receptor(Cavia porcellus)
American Cyanamid
Curated by ChEMBL
LigandPNGBDBM50006050(3-{3-[(4-Dodecyloxy-2-hexanoyl-phenoxy)-hydroxy-ph...)
Affinity DataIC50:  610nM. Assay description: Inhibition of PAF induced platelet aggregation in rabbit
In DepthDetails ArticlePubMed