BDBM50006360 6'-methoxy-3'-methyl-1'H,2H,5H-spiro[imidazolidine-4,4'-quinazoline]-2,2',5(3'H)-trione::CHEMBL62906
SMILES COc1ccc2NC(=O)N(C)C3(NC(=O)NC3=O)c2c1
InChI Key InChIKey=FDCPMTHUEOIZIV-UHFFFAOYSA-N
Data  1 IC50
  Tab Delimited (TSV)   2D SDfile   Computed 3D by Vconf -m prep SDfile
Find this compound or compounds like it in BindingDB:
Activity Spreadsheet -- Enzyme Inhibition Constant Data from BindingDB
Found 1 hit for monomerid = 50006360
TargetAldo-keto reductase family 1 member B1(Homo sapiens (Human))
Tanabe Seiyaku
Curated by ChEMBL
LigandPNGBDBM50006360(6'-methoxy-3'-methyl-1'H,2H,5H-spiro[imidazolidine...)
Affinity DataIC50:  4.50E+3nM. Assay description: Tested in vitro for inhibitory activity against partially purified aldose reductase from male rabbit lens
In DepthDetails ArticlePubMed