BDBM50007372 2-(3,4-Dichloro-phenyl)-N-{1-[(isopropyl-methyl-amino)-methyl]-2-methyl-propyl}-N-methyl-acetamide::CHEMBL323410
SMILES CC(C)[C@@H](CN(C)C(C)C)N(C)C(=O)Cc1ccc(Cl)c(Cl)c1
InChI Key InChIKey=OENAHTKBTCKJTP-QGZVFWFLSA-N
Data  1 IC50
  Tab Delimited (TSV)   2D SDfile   Computed 3D by Vconf -m prep SDfile
Find this compound or compounds like it in BindingDB:
Activity Spreadsheet -- Enzyme Inhibition Constant Data from BindingDB
Found 1 hit for monomerid = 50007372
TargetKappa-type opioid receptor(Cavia porcellus (domestic guinea pig))
Ici Pharmaceuticals Group
Curated by ChEMBL
LigandPNGBDBM50007372(2-(3,4-Dichloro-phenyl)-N-{1-[(isopropyl-methyl-am...)
Affinity DataIC50:  15nM. Assay description: Binding affinity against opioid receptor kappa in guinea pig brain membrane using [3H]bremazocine as the radioligand
In DepthDetails ArticlePubMed