BDBM50007381 CHEMBL107780::N-Methyl-N-(2-methyl-1-pyrrolidin-1-ylmethyl-propyl)-2-(4-nitro-phenyl)-acetamide
SMILES CC(C)[C@@H](CN1CCCC1)N(C)C(=O)Cc1ccc(cc1)[N+]([O-])=O
InChI Key InChIKey=GTBMZFRUDYKTGG-QGZVFWFLSA-N
Data  1 IC50
  Tab Delimited (TSV)   2D SDfile   Computed 3D by Vconf -m prep SDfile
Find this compound or compounds like it in BindingDB:
Activity Spreadsheet -- Enzyme Inhibition Constant Data from BindingDB
Found 1 hit for monomerid = 50007381
TargetKappa-type opioid receptor(Cavia porcellus (domestic guinea pig))
Ici Pharmaceuticals Group
Curated by ChEMBL
LigandPNGBDBM50007381(CHEMBL107780 | N-Methyl-N-(2-methyl-1-pyrrolidin-1...)
Affinity DataIC50:  92nM. Assay description: Binding affinity against opioid receptor kappa in guinea pig brain membrane using [3H]bremazocine as the radioligand
In DepthDetails ArticlePubMed