BDBM50007654 CHEMBL3233136
SMILES C[C@@H](CS(=O)(=O)C(C)(C)C)N1[C@@H]([C@H](O[C@H](CC(O)=O)C1=O)c1cccc(Cl)c1)c1ccc(Cl)cc1
InChI Key InChIKey=BDCZVHOYIUXHLE-APQCTARYSA-N
Data  2 IC50
  Tab Delimited (TSV)   2D SDfile   Computed 3D by Vconf -m prep SDfile
Find this compound or compounds like it in BindingDB:
Activity Spreadsheet -- Enzyme Inhibition Constant Data from BindingDB
Found 2 hits for monomerid = 50007654
TargetE3 ubiquitin-protein ligase Mdm2(Homo sapiens (Human))
Amgen
Curated by ChEMBL
LigandPNGBDBM50007654(CHEMBL3233136)
Affinity DataIC50:  6.90nM. Assay description: Binding affinity to GST-thrombin-tagged human MDM2 (1 to 188) expressed in Escherichia coli assessed as inhibition of interaction with p53 in buffer ...
In DepthDetails ArticlePubMed
TargetE3 ubiquitin-protein ligase Mdm2(Homo sapiens (Human))
Amgen
Curated by ChEMBL
LigandPNGBDBM50007654(CHEMBL3233136)
Affinity DataIC50:  1.10nM. Assay description: Binding affinity to GST-thrombin-tagged human MDM2 (1 to 188) expressed in Escherichia coli assessed as inhibition of interaction with p53 in serum f...
In DepthDetails ArticlePubMed