BDBM50007852 2-(2,6-Dioxo-1,3-dipropyl-2,3,6,7-tetrahydro-1H-purin-8-yl)-cyclopent-1-enecarboxylic acid (H2O)::CHEMBL301403
SMILES CCCn1c2nc([nH]c2c(=O)n(CCC)c1=O)C1=C(CCC1)C(O)=O
InChI Key InChIKey=NCXBTLIXNVJPLZ-UHFFFAOYSA-N
Data  2 KI
  Tab Delimited (TSV)   2D SDfile   Computed 3D by Vconf -m prep SDfile
Find this compound or compounds like it in BindingDB:
Activity Spreadsheet -- Enzyme Inhibition Constant Data from BindingDB
Found 2 hits for monomerid = 50007852
TargetAdenosine receptor A2a/A2b(Rattus norvegicus)
Vanderbilt University
Curated by ChEMBL
LigandPNGBDBM50007852(2-(2,6-Dioxo-1,3-dipropyl-2,3,6,7-tetrahydro-1H-pu...)
Affinity DataKi: >1.00E+4nM. Assay description: Antagonistic activity against adenosine A2 receptor in rat adipocytes
In DepthDetails ArticlePubMed
TargetAdenosine receptor A1(Homo sapiens (Human))
Vanderbilt University
Curated by ChEMBL
LigandPNGBDBM50007852(2-(2,6-Dioxo-1,3-dipropyl-2,3,6,7-tetrahydro-1H-pu...)
Affinity DataKi: >1.00E+4nM. Assay description: Antagonist activity against adenosine A1 receptor in human platelets
In DepthDetails ArticlePubMed