BDBM50008566 2,4-Dimethyl-indan-1-one::CHEMBL352247
SMILES CC1Cc2c(cccc2C)C1=O
InChI Key InChIKey=ZDCQKZOFWPDZHL-UHFFFAOYSA-N
Data  2 IC50
  Tab Delimited (TSV)   2D SDfile   Computed 3D by Vconf -m prep SDfile
Find this compound or compounds like it in BindingDB:
Activity Spreadsheet -- Enzyme Inhibition Constant Data from BindingDB
Found 2 hits for monomerid = 50008566
TargetAcetylcholinesterase(Homo sapiens (Human))
University of Illinois
Curated by ChEMBL
LigandPNGBDBM50008566(2,4-Dimethyl-indan-1-one | CHEMBL352247)
Affinity DataIC50:  380nM. Assay description: IC50 against acetylcholinesterase; value ranges from 1.3-380 nM.
In DepthDetails ArticlePubMed
TargetAcetylcholinesterase(Homo sapiens (Human))
University of Illinois
Curated by ChEMBL
LigandPNGBDBM50008566(2,4-Dimethyl-indan-1-one | CHEMBL352247)
Affinity DataIC50:  7.10nM. Assay description: Inhibition of acetylcholinesterase.
In DepthDetails ArticlePubMed