BDBM500089 US11021457, Compound 101
SMILES O=C(N1CCN(CCNC=C2C(=O)CC(CC2=O)c2ccccc2)CC1)N1C(=O)CCC(N2C(=O)c3ccccc3C2=O)C1=O
InChI Key InChIKey=YCAQBCXAVKTPLD-QQTULTPQSA-N
Data  1 IC50
  Tab Delimited (TSV)   2D SDfile   Computed 3D by Vconf -m prep SDfile
Find this compound or compounds like it in BindingDB:
Activity Spreadsheet -- Enzyme Inhibition Constant Data from BindingDB
Found 1 hit for monomerid = 500089
TargetMicrotubule-associated proteins 1A/1B light chain 3B(Human)
Wigen Biomedicine Technology (Shanghai)
US Patent
LigandPNGBDBM500089(US11021457, Compound 101)
Affinity DataIC50:  275nM. Assay description: By constructing a prokaryotic expression system, the LC3B protein was successfully expressed and purified, and a preliminary screening and verificati...
Ligand InfoPC cidPC sid
In DepthDetails US Patent