BDBM50009045 Acetic acid 2-(pyridin-2-ylmethanesulfinyl)-benzoimidazol-1-ylmethyl ester::CHEMBL275917
SMILES CC(=O)OCn1c(nc2ccccc12)S(=O)Cc1ccccn1
InChI Key InChIKey=DXEBEBRFBVATNJ-UHFFFAOYSA-N
Data  1 IC50
  Tab Delimited (TSV)   2D SDfile   Computed 3D by Vconf -m prep SDfile
Find this compound or compounds like it in BindingDB:
Activity Spreadsheet -- Enzyme Inhibition Constant Data from BindingDB
Found 1 hit for monomerid = 50009045
LigandPNGBDBM50009045(Acetic acid 2-(pyridin-2-ylmethanesulfinyl)-benzoi...)
Affinity DataIC50:  8.00E+3nM. Assay description: Activity was evaluated by measuring the inhibition of isolated hog H+/K+ ATPase
In DepthDetails ArticlePubMed