BDBM50009591 1-(2-Methyl-1-phenyl-cyclohexyl)-piperidine::CHEMBL424429::cis-1-(2-Methyl-1-phenyl-cyclohexyl)-piperidine::trans-1-(2-Methyl-1-phenyl-cyclohexyl)-piperidine
SMILES CC1CCCCC1(N1CCCCC1)c1ccccc1
InChI Key InChIKey=CBVUKHMVMNBFQP-UHFFFAOYSA-N
Data  6 KI
  Tab Delimited (TSV)   2D SDfile   Computed 3D by Vconf -m prep SDfile
Find this compound or compounds like it in BindingDB:
Activity Spreadsheet -- Enzyme Inhibition Constant Data from BindingDB
Found 6 hits for monomerid = 50009591
TargetGlutamate receptor ionotropic, NMDA 1(RAT)
Istituto Superiore Di Sanità
Curated by ChEMBL
LigandPNGBDBM50009591(1-(2-Methyl-1-phenyl-cyclohexyl)-piperidine | CHEM...)
Affinity DataKi:  11nM. Assay description: Binding affinity of the compound was determined by displacement of [3H]-TCP from PCP N-methyl-D-aspartate glutamate receptor of tissue homogenate pre...
In DepthDetails ArticlePubMed
TargetGlutamate receptor ionotropic, NMDA 1(RAT)
Istituto Superiore Di Sanità
Curated by ChEMBL
LigandPNGBDBM50009591(1-(2-Methyl-1-phenyl-cyclohexyl)-piperidine | CHEM...)
Affinity DataKi:  25nM. Assay description: Binding affinity by displacement of [3H]TCP from PCP N-methyl-D-aspartate glutamate receptor of tissue homogenate preparation of rat brain without ce...
In DepthDetails ArticlePubMed
TargetGlutamate receptor ionotropic, NMDA 1(RAT)
Istituto Superiore Di Sanità
Curated by ChEMBL
LigandPNGBDBM50009591(1-(2-Methyl-1-phenyl-cyclohexyl)-piperidine | CHEM...)
Affinity DataKi:  2.18E+3nM. Assay description: Binding affinity of the compound was determined by displacement of [3H]-TCP from PCP N-methyl-D-aspartate glutamate receptor of tissue homogenate pre...
In DepthDetails ArticlePubMed
TargetGlutamate receptor ionotropic, NMDA 1(RAT)
Istituto Superiore Di Sanità
Curated by ChEMBL
LigandPNGBDBM50009591(1-(2-Methyl-1-phenyl-cyclohexyl)-piperidine | CHEM...)
Affinity DataKi:  2.94E+3nM. Assay description: Binding affinity by displacement of [3H]TCP from PCP N-methyl-D-aspartate glutamate receptor of tissue homogenate preparation of rat brain without ce...
In DepthDetails ArticlePubMed
TargetGlutamate receptor ionotropic, NMDA 1(RAT)
Istituto Superiore Di Sanità
Curated by ChEMBL
LigandPNGBDBM50009591(1-(2-Methyl-1-phenyl-cyclohexyl)-piperidine | CHEM...)
Affinity DataKi:  7.40E+3nM. Assay description: Binding affinity by displacement of [3H]TCP from PCP N-methyl-D-aspartate glutamate receptor of tissue homogenate preparation of rat brain without ce...
In DepthDetails ArticlePubMed
TargetGlutamate receptor ionotropic, NMDA 1(RAT)
Istituto Superiore Di Sanità
Curated by ChEMBL
LigandPNGBDBM50009591(1-(2-Methyl-1-phenyl-cyclohexyl)-piperidine | CHEM...)
Affinity DataKi:  7.40E+3nM. Assay description: Binding affinity by displacement of [3H]TCP from PCP N-methyl-D-aspartate glutamate receptor of tissue homogenate preparation of rat brain without ce...
In DepthDetails ArticlePubMed