BDBM50009768 (7-Chloro-3-naphtho[1,2-d]thiazol-2-ylmethyl-4-oxo-3,4-dihydro-phthalazin-1-yl)-acetic acid::CHEMBL2079662::CHEMBL279275
SMILES OC(=O)Cc1nn(Cc2nc3c(ccc4ccccc34)s2)c(=O)c2ccc(Cl)cc12
InChI Key InChIKey=QNAYWPPENIEFMQ-UHFFFAOYSA-N
Data  2 IC50
  Tab Delimited (TSV)   2D SDfile   Computed 3D by Vconf -m prep SDfile
Find this compound or compounds like it in BindingDB:
Activity Spreadsheet -- Enzyme Inhibition Constant Data from BindingDB
Found 2 hits for monomerid = 50009768
TargetAldo-keto reductase family 1 member B1(Homo sapiens (Human))
Pfizer
Curated by ChEMBL
LigandPNGBDBM50009768((7-Chloro-3-naphtho[1,2-d]thiazol-2-ylmethyl-4-oxo...)
Affinity DataIC50:  300nM. Assay description: Inhibition of aldose reductase (aldo-keto reductase, AKR1B1) isolated from human placenta.
In DepthDetails ArticlePubMed
TargetAldo-keto reductase family 1 member B1(Homo sapiens (Human))
Pfizer
Curated by ChEMBL
LigandPNGBDBM50009768((7-Chloro-3-naphtho[1,2-d]thiazol-2-ylmethyl-4-oxo...)
Affinity DataIC50:  350nM. Assay description: Inhibition of aldose reductase (aldo-keto reductase, AKR1B1) isolated from human placenta.
In DepthDetails ArticlePubMed