BDBM50010425 BOC-Phe-Gly-Leu-psi[CHOHCH2]Gly-Ile N-[(4-amino-2-methyl-5-pyrimidinyl)methyl]amide::CHEMBL109429
SMILES CC[C@H](C)[C@H](NC(=O)[C@@H](C[C@H](O)[C@H](CC(C)C)NC(=O)CNC(=O)[C@H](Cc1ccccc1)NC(=O)OC(C)(C)C)C(C)C)C(=O)NCc1cnc(C)nc1N
InChI Key InChIKey=HQWUNRFDHMRGJE-DHWQJOKWSA-N
Data  3 IC50
  Tab Delimited (TSV)   2D SDfile   Computed 3D by Vconf -m prep SDfile
Find this compound or compounds like it in BindingDB:
Activity Spreadsheet -- Enzyme Inhibition Constant Data from BindingDB
Found 3 hits for monomerid = 50010425
TargetPepsin A(Porcine)
E. Merck Darmstadt
Curated by ChEMBL
LigandPNGBDBM50010425(BOC-Phe-Gly-Leu-psi[CHOHCH2]Gly-Ile N-[(4-amino-2-...)
Affinity DataIC50:  1.40E+3nM. Assay description: In vitro inhibitory activity against porcine Pepsin.
In DepthDetails ArticlePubMed
TargetRenin(Homo sapiens (Human))
E. Merck Darmstadt
Curated by ChEMBL
LigandPNGBDBM50010425(BOC-Phe-Gly-Leu-psi[CHOHCH2]Gly-Ile N-[(4-amino-2-...)
Affinity DataIC50:  5.40nM. Assay description: In vitro for inhibitory activity against human renin
In DepthDetails ArticlePubMed
TargetCathepsin D(Bos taurus)
E. Merck Darmstadt
Curated by ChEMBL
LigandPNGBDBM50010425(BOC-Phe-Gly-Leu-psi[CHOHCH2]Gly-Ile N-[(4-amino-2-...)
Affinity DataIC50:  3.90E+3nM. Assay description: In vitro inhibitory activity against bovine Cathepsin D
In DepthDetails ArticlePubMed