BDBM50010518 CHEMBL3264379
SMILES Clc1ccc(cc1)N1CCN(CCNC(=O)c2ccc3ccccc3c2)CC1
InChI Key InChIKey=MPGNWZSKUZMCOC-UHFFFAOYSA-N
Data  1 KI
  Tab Delimited (TSV)   2D SDfile   Computed 3D by Vconf -m prep SDfile
Find this compound or compounds like it in BindingDB:
Activity Spreadsheet -- Enzyme Inhibition Constant Data from BindingDB
Found 1 hit for monomerid = 50010518
Target5-hydroxytryptamine receptor 1A(Homo sapiens (Human))
University Of Li£Ge
Curated by ChEMBL
LigandPNGBDBM50010518(CHEMBL3264379)
Affinity DataKi:  51nM. Assay description: Displacement of [3H]-8-OH-OPAT from human recombinant 5HT1A receptor expressed in CHO cells after 60 mins by liquid scintillation counting analysis
In DepthDetails ArticlePubMed