BDBM50012392 2-(4-Methoxy-phenyl)-5-phenyl-thiazol-4-ol::CHEMBL65940
SMILES COc1ccc(cc1)-c1nc(O)c(s1)-c1ccccc1
InChI Key InChIKey=YQAKORGQQCUKEJ-UHFFFAOYSA-N
Data  3 IC50
  Tab Delimited (TSV)   2D SDfile   Computed 3D by Vconf -m prep SDfile
Find this compound or compounds like it in BindingDB:
Activity Spreadsheet -- Enzyme Inhibition Constant Data from BindingDB
Found 3 hits for monomerid = 50012392
TargetPolyunsaturated fatty acid 5-lipoxygenase(Homo sapiens (Human))
Abbott Laboratories
Curated by ChEMBL
LigandPNGBDBM50012392(2-(4-Methoxy-phenyl)-5-phenyl-thiazol-4-ol | CHEMB...)
Affinity DataIC50:  2.40E+3nM. Assay description: The compound was tested for the inhibition of 5-lipoxygenase (5-lo) in human whole blood (HWBL)
In DepthDetails ArticlePubMed
TargetPolyunsaturated fatty acid 5-lipoxygenase(Rattus norvegicus)
Abbott Laboratories
Curated by ChEMBL
LigandPNGBDBM50012392(2-(4-Methoxy-phenyl)-5-phenyl-thiazol-4-ol | CHEMB...)
Affinity DataIC50:  450nM. Assay description: Inhibition of 5-lipoxygenase (5-lo) in intact rat polymorphonuclear leukocyte RPMNL
In DepthDetails ArticlePubMed
TargetPolyunsaturated fatty acid 5-lipoxygenase(Rattus norvegicus)
Abbott Laboratories
Curated by ChEMBL
LigandPNGBDBM50012392(2-(4-Methoxy-phenyl)-5-phenyl-thiazol-4-ol | CHEMB...)
Affinity DataIC50:  370nM. Assay description: In vitro inhibition of 5-lipoxygenase (5-lo) from the 20000 g supernatant of RBI-1 cells
In DepthDetails ArticlePubMed