BDBM50012435 2-(4-Fluoro-phenyl)-5-phenyl-thiazol-4-ol::CHEMBL68429
SMILES Oc1nc(sc1-c1ccccc1)-c1ccc(F)cc1
InChI Key InChIKey=KUOOEYKNEXFFMB-UHFFFAOYSA-N
Data  3 IC50
  Tab Delimited (TSV)   2D SDfile   Computed 3D by Vconf -m prep SDfile
Find this compound or compounds like it in BindingDB:
Activity Spreadsheet -- Enzyme Inhibition Constant Data from BindingDB
Found 3 hits for monomerid = 50012435
TargetPolyunsaturated fatty acid 5-lipoxygenase(Homo sapiens (Human))
Abbott Laboratories
Curated by ChEMBL
LigandPNGBDBM50012435(2-(4-Fluoro-phenyl)-5-phenyl-thiazol-4-ol | CHEMBL...)
Affinity DataIC50:  470nM. Assay description: The compound was tested for the inhibition of 5-lipoxygenase (5-lo) in human whole blood (HWBL)
In DepthDetails ArticlePubMed
TargetPolyunsaturated fatty acid 5-lipoxygenase(Rattus norvegicus)
Goethe-University Frankfurt
Curated by ChEMBL
LigandPNGBDBM50012435(2-(4-Fluoro-phenyl)-5-phenyl-thiazol-4-ol | CHEMBL...)
Affinity DataIC50:  500nM. Assay description: Inhibition of 5-LO in rat RBL1 cells
In DepthDetails ArticlePubMed
TargetPolyunsaturated fatty acid 5-lipoxygenase(Rattus norvegicus)
Goethe-University Frankfurt
Curated by ChEMBL
LigandPNGBDBM50012435(2-(4-Fluoro-phenyl)-5-phenyl-thiazol-4-ol | CHEMBL...)
Affinity DataIC50:  500nM. Assay description: In vitro inhibition of 5-lipoxygenase (5-lo) from the 20000 g supernatant of RBI-1 cells
In DepthDetails ArticlePubMed