BDBM50012688 CHEMBL121928::Naphthalen-2-yl-phenyl-methanol (phenyl 2-naphthylcarbinol)
SMILES OC(c1ccccc1)c1ccc2ccccc2c1
InChI Key InChIKey=RVWPQZWRXDGDCG-UHFFFAOYSA-N
Data  1 IC50
  Tab Delimited (TSV)   2D SDfile   Computed 3D by Vconf -m prep SDfile
Find this compound or compounds like it in BindingDB:
Activity Spreadsheet -- Enzyme Inhibition Constant Data from BindingDB
Found 1 hit for monomerid = 50012688
TargetPolyunsaturated fatty acid 5-lipoxygenase(Rattus norvegicus)
E.I. Du Pont De Nemours
Curated by ChEMBL
LigandPNGBDBM50012688(CHEMBL121928 | Naphthalen-2-yl-phenyl-methanol (ph...)
Affinity DataIC50:  4.00E+4nM. Assay description: Ability to inhibit 5-lipoxygenase by using a crude preparation of the cytosolic enzyme from the rat basophilic leukemia (RBL-1) cell line
In DepthDetails ArticlePubMed