BDBM50012891 2-[1-(4-Chloro-benzoyl)-5-methoxy-2-methyl-1H-indol-3-yl]-N-methoxy-acetamide(Indomethacin series)::CHEMBL65130
SMILES CONC(=O)Cc1c(C)n(C(=O)c2ccc(Cl)cc2)c2ccc(OC)cc12
InChI Key InChIKey=VOHDRSOCVBBETF-UHFFFAOYSA-N
Data  2 IC50
  Tab Delimited (TSV)   2D SDfile   Computed 3D by Vconf -m prep SDfile
Find this compound or compounds like it in BindingDB:
Activity Spreadsheet -- Enzyme Inhibition Constant Data from BindingDB
Found 2 hits for monomerid = 50012891
TargetProstaglandin G/H synthase 1/2(RAT)
Warner-Lambert
Curated by ChEMBL
LigandPNGBDBM50012891(2-[1-(4-Chloro-benzoyl)-5-methoxy-2-methyl-1H-indo...)
Affinity DataIC50: <200nM. Assay description: Inhibition of Prostaglandin G/H synthase in intact RBL-1 cell line
In DepthDetails ArticlePubMed
TargetPolyunsaturated fatty acid 5-lipoxygenase(Rattus norvegicus)
Warner-Lambert
Curated by ChEMBL
LigandPNGBDBM50012891(2-[1-(4-Chloro-benzoyl)-5-methoxy-2-methyl-1H-indo...)
Affinity DataIC50:  2.40E+4nM. Assay description: Inhibition of 5-lipoxygenase in intact RBL-1 cell line
In DepthDetails ArticlePubMed