BDBM50013145 CHEMBL3262296
SMILES Cn1c2ccccc2c2cc(CCOc3ncccc3-c3ccc(Cl)cc3)cnc12
InChI Key InChIKey=SUODVAFFTJZMSH-UHFFFAOYSA-N
Data  1 IC50
  Tab Delimited (TSV)   2D SDfile   Computed 3D by Vconf -m prep SDfile
Find this compound or compounds like it in BindingDB:
Activity Spreadsheet -- Enzyme Inhibition Constant Data from BindingDB
Found 1 hit for monomerid = 50013145
TargetcAMP and cAMP-inhibited cGMP 3',5'-cyclic phosphodiesterase 10A(Homo sapiens (Human))
Glenmark Pharmaceuticals
Curated by ChEMBL
LigandPNGBDBM50013145(CHEMBL3262296)
Affinity DataIC50:  592nM. Assay description: Inhibition of N-terminal GST-tagged human recombinant PDE10A assessed as substrate hydrolysis using [3H]cAMP as substrate after 30 mins by two-step r...
In DepthDetails ArticlePubMed