BDBM50013698 8-Phenyl-9H-purine-2,6-diamine::CHEMBL66077
SMILES Nc1nc(N)c2[nH]c(nc2n1)-c1ccccc1
InChI Key InChIKey=WGJICLLGFIVHNE-UHFFFAOYSA-N
Data  1 KI  6 IC50  1 Kd
  Tab Delimited (TSV)   2D SDfile   Computed 3D by Vconf -m prep SDfile
Find this compound or compounds like it in BindingDB:
Activity Spreadsheet -- Enzyme Inhibition Constant Data from BindingDB
Found 8 hits for monomerid = 50013698
TargetPhosphatidylinositol 4-kinase type 2-alpha(Homo sapiens (Human))
Smith Kline & French Research
Curated by ChEMBL
LigandPNGBDBM50013698(8-Phenyl-9H-purine-2,6-diamine | CHEMBL66077)
Affinity DataKi:  1.38E+5nM. Assay description: Binding affinity (Ki) against human phosphatidylinositol 4-kinase
In DepthDetails ArticlePubMed
TargetDihydrofolate reductase(Pneumocystis carinii)
Duquesne University
Curated by ChEMBL
LigandPNGBDBM50013698(8-Phenyl-9H-purine-2,6-diamine | CHEMBL66077)
Affinity DataIC50:  1.53E+5nM. Assay description: Inhibition of Pneumocystis carinii dihydrofolate reductase
In DepthDetails ArticlePubMed
TargetDihydrofolate reductase(Rattus norvegicus (rat))
Duquesne University
Curated by ChEMBL
LigandPNGBDBM50013698(8-Phenyl-9H-purine-2,6-diamine | CHEMBL66077)
Affinity DataIC50:  5.99E+4nM. Assay description: Inhibition of rat liver dihydrofolate reductase
In DepthDetails ArticlePubMed
TargetVenus kinase receptor 2(Schistosoma mansoni)
Imperial College London
Curated by ChEMBL
LigandPNGBDBM50013698(8-Phenyl-9H-purine-2,6-diamine | CHEMBL66077)
Affinity DataKd:  8.20E+4nM. Assay description: Binding affinity to Schistosoma mansoni N-terminal His6-tagged full-length VKR2 kinase domain expressed in baculovirus infected Sf9 insect cells in p...
In DepthDetails PubMed
TargetDihydrofolate reductase(Rattus norvegicus (rat))
Duquesne University
Curated by ChEMBL
LigandPNGBDBM50013698(8-Phenyl-9H-purine-2,6-diamine | CHEMBL66077)
Affinity DataIC50:  5.99E+4nM. Assay description: Inhibition of rat liver DHFR by spectrophotometric assay
In DepthDetails ArticlePubMed
TargetPhosphatidylinositol 4-kinase type 2-alpha(Homo sapiens (Human))
Smith Kline & French Research
Curated by ChEMBL
LigandPNGBDBM50013698(8-Phenyl-9H-purine-2,6-diamine | CHEMBL66077)
Affinity DataIC50:  2.00E+5nM. Assay description: Inhibitory activity (IC50) against human phosphatidylinositol 4-kinase at the ATP binding site
In DepthDetails ArticlePubMed
TargetBifunctional dihydrofolate reductase-thymidylate synthase(Toxoplasma gondii)
Duquesne University
Curated by ChEMBL
LigandPNGBDBM50013698(8-Phenyl-9H-purine-2,6-diamine | CHEMBL66077)
Affinity DataIC50:  2.80E+4nM. Assay description: Inhibition of Toxoplasma gondii dihydrofolate reductase
In DepthDetails ArticlePubMed
TargetBifunctional dihydrofolate reductase-thymidylate synthase(Toxoplasma gondii)
Duquesne University
Curated by ChEMBL
LigandPNGBDBM50013698(8-Phenyl-9H-purine-2,6-diamine | CHEMBL66077)
Affinity DataIC50:  2.80E+4nM. Assay description: Inhibition of Toxoplasma gondii DHFR by spectrophotometric assay
In DepthDetails ArticlePubMed