BDBM50014019 2-{2-[(1-{2-[2-(2-Acetylamino-4-methyl-pentanoylamino)-3-carbamoyl-propionylamino]-1-hydroxy-4-methyl-pentyl}-pyrrolidine-2-carbonyl)-amino]-3-methyl-pentanoylamino}-3-methyl-butyric acid methyl ester::CHEMBL3143736
SMILES CC[C@H](C)[C@H](NC(=O)[C@@H]1CCCN1C[C@H](O)[C@H](CC(C)C)NC(=O)[C@H](CC(N)=O)NC(=O)[C@H](CC(C)C)NC(C)=O)C(=O)N[C@@H](C(C)C)C(=O)OC
InChI Key InChIKey=AZFPWNIFAYCRMG-UHFFFAOYSA-N
Data  1 KI
  Tab Delimited (TSV)   2D SDfile   Computed 3D by Vconf -m prep SDfile
Find this compound or compounds like it in BindingDB:
Activity Spreadsheet -- Enzyme Inhibition Constant Data from BindingDB
Found 1 hit for monomerid = 50014019
TargetGag-Pol polyprotein [489-587](Human immunodeficiency virus type 1)
University Of Wisconsin-Madison
Curated by ChEMBL
LigandPNGBDBM50014019(2-{2-[(1-{2-[2-(2-Acetylamino-4-methyl-pentanoylam...)
Affinity DataKi:  21nMpH: 6.4Assay Description:Inhibition of HIV protease at pH 6.4, 37 degree C
In DepthDetails ArticlePubMed