BDBM50014813 (4-Chloro-phenyl)-phenyl-pyridin-3-yl-methanol::CHEMBL342868
SMILES OC(c1ccccc1)(c1ccc(Cl)cc1)c1cccnc1
InChI Key InChIKey=GMUXFNGMJVMSHJ-UHFFFAOYSA-N
Data  1 EC50
  Tab Delimited (TSV)   2D SDfile   Computed 3D by Vconf -m prep SDfile
Find this compound or compounds like it in BindingDB:
Activity Spreadsheet -- Enzyme Inhibition Constant Data from BindingDB
Found 1 hit for monomerid = 50014813
TargetAromatase(Rattus norvegicus)
Eli Lilly
Curated by ChEMBL
LigandPNGBDBM50014813((4-Chloro-phenyl)-phenyl-pyridin-3-yl-methanol | C...)
Affinity DataEC50: >2.00E+3nM. Assay description: In vitro Cytochrome P450 19A1 inhibition concentration to decrease aromatization of androstenedione in rat ovarian microsome
In DepthDetails ArticlePubMed