BDBM50016561 2-(phenylsulfonamido)acetic acid::Benzenesulfonylamino-acetic acid::CHEMBL37054
SMILES OC(=O)CNS(=O)(=O)c1ccccc1
InChI Key InChIKey=WTSZSAHZIMPSDM-UHFFFAOYSA-N
Data  4 IC50
  Tab Delimited (TSV)   2D SDfile   Computed 3D by Vconf -m prep SDfile
Find this compound or compounds like it in BindingDB:
Activity Spreadsheet -- Enzyme Inhibition Constant Data from BindingDB
Found 4 hits for monomerid = 50016561
TargetAldo-keto reductase family 1 member B1(Rattus norvegicus)
Aristotle University Of Thessaloniki
Curated by ChEMBL
LigandPNGBDBM50016561(2-(phenylsulfonamido)acetic acid | Benzenesulfonyl...)
Affinity DataIC50:  1.34E+5nM. Assay description: Inhibition of aldose reductase in rat lenses
In DepthDetails ArticlePubMed
TargetAldo-keto reductase family 1 member B1(Rattus norvegicus)
Aristotle University Of Thessaloniki
Curated by ChEMBL
LigandPNGBDBM50016561(2-(phenylsulfonamido)acetic acid | Benzenesulfonyl...)
Affinity DataIC50:  1.30E+5nM. Assay description: Inhibitory concentration against aldose reductase obtained from rat lens
In DepthDetails ArticlePubMed
TargetAldo-keto reductase family 1 member B1(Rattus norvegicus)
Aristotle University Of Thessaloniki
Curated by ChEMBL
LigandPNGBDBM50016561(2-(phenylsulfonamido)acetic acid | Benzenesulfonyl...)
Affinity DataIC50:  1.34E+5nM. Assay description: Inhibition of rat lens ALR2
In DepthDetails ArticlePubMed
TargetAldo-keto reductase family 1 member B1(Rattus norvegicus)
Aristotle University Of Thessaloniki
Curated by ChEMBL
LigandPNGBDBM50016561(2-(phenylsulfonamido)acetic acid | Benzenesulfonyl...)
Affinity DataIC50:  8.67E+4nM. Assay description: Inhibition of Fischer-344 rat lens ALR2 by least-square analysis
In DepthDetails ArticlePubMed