BDBM50016583 2-(Phenylsulfonamido)benzoic Acid::2-Benzenesulfonylamino-benzoic acid::CHEMBL285503
SMILES OC(=O)c1ccccc1NS(=O)(=O)c1ccccc1
InChI Key InChIKey=KIAHUXDVSURYKM-UHFFFAOYSA-N
Data  2 KI  1 IC50
  Tab Delimited (TSV)   2D SDfile   Computed 3D by Vconf -m prep SDfile
Find this compound or compounds like it in BindingDB:
Activity Spreadsheet -- Enzyme Inhibition Constant Data from BindingDB
Found 3 hits for monomerid = 50016583
TargetInduced myeloid leukemia cell differentiation protein Mcl-1(Homo sapiens (Human))
National Institute Of Chemistry
Curated by ChEMBL
LigandPNGBDBM50016583(2-(Phenylsulfonamido)benzoic Acid | 2-Benzenesulfo...)
Affinity DataKi:  4.78E+4nM. Assay description: Inhibition of N-terminal His6-tagged human Mcl1 expressed in Escherichia coli Rosetta2 DE3 by fluorescent labeled Flu-Bid peptide based fluorescence ...
In DepthDetails ArticlePubMed
TargetBcl-2-related protein A1(Homo sapiens (Human))
National Institute Of Chemistry
Curated by ChEMBL
LigandPNGBDBM50016583(2-(Phenylsulfonamido)benzoic Acid | 2-Benzenesulfo...)
Affinity DataKi: >1.00E+5nM. Assay description: Inhibition of N-terminal His6-tagged human Bfl-1 (1 to 151 residues), expressed in Escherichia coli Rosetta2 DE3 by fluorescent labeled FAM-Bid pepti...
In DepthDetails ArticlePubMed
TargetAldo-keto reductase family 1 member B1(Rattus norvegicus)
Auburn University
Curated by ChEMBL
LigandPNGBDBM50016583(2-(Phenylsulfonamido)benzoic Acid | 2-Benzenesulfo...)
Affinity DataIC50:  6.50E+4nM. Assay description: Inhibitory concentration against aldose reductase obtained from rat lens
In DepthDetails ArticlePubMed