BDBM50016590 (Benzenesulfonyl-m-tolyl-amino)-acetic acid::CHEMBL38181
SMILES Cc1cccc(c1)N(CC(O)=O)S(=O)(=O)c1ccccc1
InChI Key InChIKey=CRRKUZBZMCUHGR-UHFFFAOYSA-N
Data  1 IC50
  Tab Delimited (TSV)   2D SDfile   Computed 3D by Vconf -m prep SDfile
Find this compound or compounds like it in BindingDB:
Activity Spreadsheet -- Enzyme Inhibition Constant Data from BindingDB
Found 1 hit for monomerid = 50016590
TargetAldo-keto reductase family 1 member B1(Rattus norvegicus)
Auburn University
Curated by ChEMBL
LigandPNGBDBM50016590((Benzenesulfonyl-m-tolyl-amino)-acetic acid | CHEM...)
Affinity DataIC50:  2.70E+4nM. Assay description: Inhibitory concentration against aldose reductase obtained from rat lens
In DepthDetails ArticlePubMed