BDBM50016616 (4-Chloro-benzoylamino)-acetic acid::4-Chlorohippuric acid::CHEMBL462
SMILES OC(=O)CNC(=O)c1ccc(Cl)cc1
InChI Key InChIKey=COYZIYOEXGRBHQ-UHFFFAOYSA-N
Data  1 IC50
  Tab Delimited (TSV)   2D SDfile   Computed 3D by Vconf -m prep SDfile
Find this compound or compounds like it in BindingDB:
Activity Spreadsheet -- Enzyme Inhibition Constant Data from BindingDB
Found 1 hit for monomerid = 50016616
TargetAldo-keto reductase family 1 member B1(Rattus norvegicus)
Auburn University
Curated by ChEMBL
LigandPNGBDBM50016616((4-Chloro-benzoylamino)-acetic acid | 4-Chlorohipp...)
Affinity DataIC50:  5.50E+5nM. Assay description: Inhibition of aldose reductase from rat lens. Value ranges from 300 - 1100
In DepthDetails ArticlePubMed