BDBM50016617 (4-Methoxy-benzoylamino)-acetic acid::4-Methoxyhippuric acid::CHEMBL8441::cid_128847
SMILES COc1ccc(cc1)C(=O)NCC(O)=O
InChI Key InChIKey=SIEIOUWSTGWJGE-UHFFFAOYSA-N
Data  3 IC50
  Tab Delimited (TSV)   2D SDfile   Computed 3D by Vconf -m prep SDfile
Find this compound or compounds like it in BindingDB:
Activity Spreadsheet -- Enzyme Inhibition Constant Data from BindingDB
Found 3 hits for monomerid = 50016617
TargetGlucose-6-phosphate 1-dehydrogenase(Leuconostoc mesenteroides)
University Of Pittsburgh
Curated by PubChem BioAssay
LigandPNGBDBM50016617((4-Methoxy-benzoylamino)-acetic acid | 4-Methoxyhi...)
Affinity DataIC50: >2.50E+4nM. Assay description: Excerpt from MH082340 application (Dr. James Morris, Clemson University) Trypanosoma brucei, the digenic protozoan parasite that causes African sleep...
In DepthDetails PCBioAssay
TargetAldo-keto reductase family 1 member B1(Rattus norvegicus)
Auburn University
Curated by ChEMBL
LigandPNGBDBM50016617((4-Methoxy-benzoylamino)-acetic acid | 4-Methoxyhi...)
Affinity DataIC50:  7.10E+4nM. Assay description: Inhibition of aldose reductase from rat lens. Value ranges from 35-160
In DepthDetails ArticlePubMed
TargetPhosphotransferase(Trypanosoma brucei)
University Of Pittsburgh
Curated by PubChem BioAssay
LigandPNGBDBM50016617((4-Methoxy-benzoylamino)-acetic acid | 4-Methoxyhi...)
Affinity DataIC50:  2.50E+4nM. Assay description: Excerpt from MH0882340 application (Dr. James Morris, Clemson University) Trypanosoma brucei, the digenic protozoan parasite that causes African slee...
In DepthDetails PCBioAssay