BDBM50017198 CHEBI:83326::TEDIZOLID PHOSPHATE::TR-701-FA
SMILES Cn1nnc(n1)-c1ccc(cn1)-c1ccc(cc1F)N1C[C@H](COP(O)(O)=O)OC1=O
InChI Key InChIKey=QCGUSIANLFXSGE-GFCCVEGCSA-N
Data  1 IC50
  Tab Delimited (TSV)   2D SDfile   Computed 3D by Vconf -m prep SDfile
Find this compound or compounds like it in BindingDB:
Activity Spreadsheet -- Enzyme Inhibition Constant Data from BindingDB
Found 1 hit for monomerid = 50017198
TargetAmine oxidase [flavin-containing] A(Homo sapiens (Human))
Micurx Pharmaceuticals
Curated by ChEMBL
LigandPNGBDBM50017198(CHEBI:83326 | TEDIZOLID PHOSPHATE | TR-701-FA)
Affinity DataIC50:  4.00E+3nM. Assay description: Inhibition of human recombinant MAO-A expressed in yeast after 1 hr by luciferin-based luminescence assay
In DepthDetails ArticlePubMed