BDBM50017225 (methylamino)acetic acid::(methylamino)ethanoic acid::CHEMBL304383::N-methylaminoacetic acid::Sar::methylaminoacetic acid::sarcosine::sarcosinic acid
SMILES CNCC(O)=O
InChI Key InChIKey=FSYKKLYZXJSNPZ-UHFFFAOYSA-N
Data  1 KI  1 IC50
  Tab Delimited (TSV)   2D SDfile   Computed 3D by Vconf -m prep SDfile
Find this compound or compounds like it in BindingDB:
Activity Spreadsheet -- Enzyme Inhibition Constant Data from BindingDB
Found 2 hits for monomerid = 50017225
TargetProton-coupled amino acid transporter 1(Homo sapiens (Human))
Martin-Luther-University Halle-Wittenberg
Curated by ChEMBL
LigandPNGBDBM50017225((methylamino)acetic acid | (methylamino)ethanoic a...)
Affinity DataKi:  1.90E+6nM. Assay description: Inhibition of human PAT1-mediated L-[3H]proline uptake in human Caco2 cells after 10 mins by liquid scintillation countingChecked by Author
In DepthDetails ArticlePubMed
TargetSodium- and chloride-dependent glycine transporter 1(Homo sapiens (Human))
Albany College Of Pharmacy And Health Sciences
Curated by ChEMBL
LigandPNGBDBM50017225((methylamino)acetic acid | (methylamino)ethanoic a...)
Affinity DataIC50:  9.10E+4nM. Assay description: Inhibition of human GlyT-1
In DepthDetails ArticlePubMed