BDBM50018130 2-Phenyl-6-(4-phenyl-piperidin-1-yl)-cyclohexanol::CHEMBL20593
SMILES O[C@H]1[C@@H](CCC[C@H]1c1ccccc1)N1CCC(CC1)c1ccccc1
InChI Key InChIKey=ARMCCMGWCGEPLI-YTFSRNRJSA-N
Data  1 IC50
  Tab Delimited (TSV)   2D SDfile   Computed 3D by Vconf -m prep SDfile
Find this compound or compounds like it in BindingDB:
Activity Spreadsheet -- Enzyme Inhibition Constant Data from BindingDB
Found 1 hit for monomerid = 50018130
TargetVesicular acetylcholine transporter(Homo sapiens (Human))
University Of California
Curated by ChEMBL
LigandPNGBDBM50018130(2-Phenyl-6-(4-phenyl-piperidin-1-yl)-cyclohexanol ...)
Affinity DataIC50:  600nM. Assay description: Inhibition of active transport of [3H]-Acetylcholine using purified Torpedo californica synaptic vesicles
In DepthDetails ArticlePubMed