BDBM50020756 CHEMBL348043::[(3-Acetylsulfanyl-2-methyl-propionyl)-m-tolyl-amino]-acetic acid
SMILES CC(CSC(C)=O)C(=O)N(CC(O)=O)c1cccc(C)c1
InChI Key InChIKey=KYLMCMYDQDSVTM-UHFFFAOYSA-N
Data  1 IC50
  Tab Delimited (TSV)   2D SDfile   Computed 3D by Vconf -m prep SDfile
Find this compound or compounds like it in BindingDB:
Activity Spreadsheet -- Enzyme Inhibition Constant Data from BindingDB
Found 1 hit for monomerid = 50020756
TargetAngiotensin-converting enzyme(Oryctolagus cuniculus)
TBA
Curated by ChEMBL
LigandPNGBDBM50020756(CHEMBL348043 | [(3-Acetylsulfanyl-2-methyl-propion...)
Affinity DataIC50:  75nM. Assay description: In vitro inhibitory activity against rabbit lung Angiotensin I converting enzyme at pH 8.3
In DepthDetails ArticlePubMed