BDBM50020821 CHEMBL113612::[Cyclopentyl-(4-mercapto-benzoyl)-amino]-acetic acid
SMILES OC(=O)CN(C1CCCC1)C(=O)c1ccc(S)cc1
InChI Key InChIKey=XCLALVOKJAHCDY-UHFFFAOYSA-N
Data  1 IC50
  Tab Delimited (TSV)   2D SDfile   Computed 3D by Vconf -m prep SDfile
Find this compound or compounds like it in BindingDB:
Activity Spreadsheet -- Enzyme Inhibition Constant Data from BindingDB
Found 1 hit for monomerid = 50020821
TargetAngiotensin-converting enzyme(Oryctolagus cuniculus)
TBA
Curated by ChEMBL
LigandPNGBDBM50020821(CHEMBL113612 | [Cyclopentyl-(4-mercapto-benzoyl)-a...)
Affinity DataIC50:  0.0210nM. Assay description: In vitro inhibitory activity against Angiotensin I converting enzyme
In DepthDetails ArticlePubMed