BDBM50021188 CHEMBL3287662
SMILES COc1nc2cccnc2n1-c1ccc(Nc2ccc(C)cn2)cc1
InChI Key InChIKey=ZAIBUTICQXDSIC-UHFFFAOYSA-N
Data  1 IC50
PDB links: 1 PDB ID matches this monomer.
  Tab Delimited (TSV)   2D SDfile   Computed 3D by Vconf -m prep SDfile
Find this compound or compounds like it in BindingDB:
Activity Spreadsheet -- Enzyme Inhibition Constant Data from BindingDB
Found 1 hit for monomerid = 50021188
LigandPNGBDBM50021188(CHEMBL3287662)
Affinity DataIC50:  4.10nM. Assay description: Inhibition of human recombinant PDE10A using cAMP as substrate after 1 hr by IMAP-FRET assay