BDBM50021428 Biphenyl-2-carboxylic acid 2-diethylamino-ethyl ester::CHEMBL288900
SMILES CCN(CC)CCOC(=O)c1ccccc1-c1ccccc1
InChI Key InChIKey=MPJGIMMWUMHDGR-UHFFFAOYSA-N
Data  1 IC50
  Tab Delimited (TSV)   2D SDfile   Computed 3D by Vconf -m prep SDfile
Find this compound or compounds like it in BindingDB:
Activity Spreadsheet -- Enzyme Inhibition Constant Data from BindingDB
Found 1 hit for monomerid = 50021428
TargetSodium channel protein type 1/2/3 subunit alpha(Homo sapiens (Human))
TBA
Curated by ChEMBL
LigandPNGBDBM50021428(Biphenyl-2-carboxylic acid 2-diethylamino-ethyl es...)
Affinity DataIC50:  7.50E+3nM. Assay description: Inhibition of [3H]-BTX binding to guinea pig voltage-dependent sodium channel
In DepthDetails ArticlePubMed