BDBM50022292 3-Methyl-2-(3-methyl-butyrylamino)-N-{3-methyl-1-[2-({[1-(3-methyl-butylcarbamoyl)-ethylcarbamoyl]-methyl}-amino)-acetyl]-butyl}-butyramide::CHEMBL127425
SMILES CC(C)CCNC(=O)C(C)NC(=O)CCC(=O)[C@H](CC(C)C)NC(=O)C(NC(=O)CC(C)C)C(C)C
InChI Key InChIKey=MLRCOFFNFWUZQM-JQJXBVGUSA-N
Data  1 KI
  Tab Delimited (TSV)   2D SDfile   Computed 3D by Vconf -m prep SDfile
Find this compound or compounds like it in BindingDB:
Activity Spreadsheet -- Enzyme Inhibition Constant Data from BindingDB
Found 1 hit for monomerid = 50022292
TargetPepsin A(Porcine)
TBA
Curated by ChEMBL
LigandPNGBDBM50022292(3-Methyl-2-(3-methyl-butyrylamino)-N-{3-methyl-1-[...)
Affinity DataKi:  2.14E+3nM. Assay description: Inhibition of porcine pepsin
In DepthDetails ArticlePubMed