BDBM50023519 2-Acetylamino-2-methyl-propionic acid 4-benzoyl-phenyl ester::CHEMBL9816
SMILES CC(=O)NC(C)(C)C(=O)Oc1ccc(cc1)C(=O)c1ccccc1
InChI Key InChIKey=SIDNDLYPCDZFCK-UHFFFAOYSA-N
Data  1 IC50
  Tab Delimited (TSV)   2D SDfile   Computed 3D by Vconf -m prep SDfile
Find this compound or compounds like it in BindingDB:
Activity Spreadsheet -- Enzyme Inhibition Constant Data from BindingDB
Found 1 hit for monomerid = 50023519
TargetNeutrophil elastase(Homo sapiens (Human))
Searle Research And Development
Curated by ChEMBL
LigandPNGBDBM50023519(2-Acetylamino-2-methyl-propionic acid 4-benzoyl-ph...)
Affinity DataIC50:  1.90E+4nM. Assay description: Inhibitory activity against human leukocyte elastase at 10e-5 M
In DepthDetails ArticlePubMed