BDBM50023559 CHEMBL9784::Propionic acid 4-benzoyl-phenyl ester
SMILES CCC(=O)Oc1ccc(cc1)C(=O)c1ccccc1
InChI Key InChIKey=NHYDENVTRBMQIC-UHFFFAOYSA-N
Data  1 IC50
  Tab Delimited (TSV)   2D SDfile   Computed 3D by Vconf -m prep SDfile
Find this compound or compounds like it in BindingDB:
Activity Spreadsheet -- Enzyme Inhibition Constant Data from BindingDB
Found 1 hit for monomerid = 50023559
TargetNeutrophil elastase(Homo sapiens (Human))
Searle Research And Development
Curated by ChEMBL
LigandPNGBDBM50023559(CHEMBL9784 | Propionic acid 4-benzoyl-phenyl ester)
Affinity DataIC50:  6.20E+3nM. Assay description: Inhibitory activity against human leukocyte elastase at 10e-6 M
In DepthDetails ArticlePubMed