BDBM50024196 4-(2-{4-[2-(2-Benzyloxycarbonylamino-ethanesulfonylamino)-3-methyl-butyrylamino]-3-hydroxy-6-methyl-heptanoylamino}-propionylamino)-3-hydroxy-6-methyl-heptanoic acid methyl ester::CHEMBL3349368
SMILES COC(=O)CC(O)[C@H](CC(C)C)NC(=O)[C@H](C)NC(=O)CC(O)[C@H](CC(C)C)NC(=O)[C@@H](NS(=O)(=O)CCNC(=O)OCc1ccccc1)C(C)C
InChI Key InChIKey=CNXLUUQKOJCLBL-UHFFFAOYSA-N
Data  1 IC50
  Tab Delimited (TSV)   2D SDfile   Computed 3D by Vconf -m prep SDfile
Find this compound or compounds like it in BindingDB:
Activity Spreadsheet -- Enzyme Inhibition Constant Data from BindingDB
Found 1 hit for monomerid = 50024196
TargetRenin(Homo sapiens (Human))
TBA
Curated by ChEMBL
LigandPNGBDBM50024196(4-(2-{4-[2-(2-Benzyloxycarbonylamino-ethanesulfony...)
Affinity DataIC50: >1.00E+4nM. Assay description: In vitro inhibitory activity against human plasma renin
In DepthDetails ArticlePubMed