BDBM50025512 CHEMBL3392094::{2-Methyl-1-[2-methyl-1-(3-methyl-1-{1-methyl-2-[1-(3-methyl-butylcarbamoyl)-ethylcarbamoyl]-ethyl}-butylcarbamoyl)-propylcarbamoyl]-propyl}-carbamic acid tert-butyl ester
SMILES CC(C)CCNC(=O)[C@H](C)NC(=O)C[C@H](C)[C@H](CC(C)C)NC(=O)[C@@H](NC(=O)[C@@H](NC(=O)OC(C)(C)C)C(C)C)C(C)C
InChI Key InChIKey=XHAGYXYLFCHAMX-AEHWDRQNSA-N
Data  2 KI
  Tab Delimited (TSV)   2D SDfile   Computed 3D by Vconf -m prep SDfile
Find this compound or compounds like it in BindingDB:
Activity Spreadsheet -- Enzyme Inhibition Constant Data from BindingDB
Found 2 hits for monomerid = 50025512
TargetCathepsin D(Bos taurus)
TBA
Curated by ChEMBL
LigandPNGBDBM50025512(CHEMBL3392094 | {2-Methyl-1-[2-methyl-1-(3-methyl-...)
Affinity DataKi:  620nM. Assay description: Inhibition of cathepsin D.
In DepthDetails ArticlePubMed
TargetCathepsin D(Bos taurus)
TBA
Curated by ChEMBL
LigandPNGBDBM50025512(CHEMBL3392094 | {2-Methyl-1-[2-methyl-1-(3-methyl-...)
Affinity DataKi:  2.00E+3nM. Assay description: Inhibition of cathepsin D.
In DepthDetails ArticlePubMed