BDBM50025527 2-{3-Hydroxy-6-methyl-4-[3-methyl-2-(3-methyl-butyrylamino)-butyrylamino]-heptanoylamino}-propionic acid methyl ester::CHEMBL3392103
SMILES [H][C@](O)(CC(=O)N[C@@H](C)C(=O)OC)[C@H](CC(C)C)NC(=O)[C@@H](NC(=O)CC(C)C)C(C)C
InChI Key InChIKey=IXBBSGVZUPOAKN-QCECMTGHSA-N
Data  1 KI
  Tab Delimited (TSV)   2D SDfile   Computed 3D by Vconf -m prep SDfile
Find this compound or compounds like it in BindingDB:
Activity Spreadsheet -- Enzyme Inhibition Constant Data from BindingDB
Found 1 hit for monomerid = 50025527
TargetCathepsin D(Bos taurus)
TBA
Curated by ChEMBL
LigandPNGBDBM50025527(2-{3-Hydroxy-6-methyl-4-[3-methyl-2-(3-methyl-buty...)
Affinity DataKi:  1.80E+3nM. Assay description: Inhibition of cathepsin D.
In DepthDetails ArticlePubMed